Reaction Details
TargetAromatase
LigandBDBM50251013
Substrate/Competitorn/a
Meas. Tech.ChEMBL_505994 (CHEMBL949646)
IC50 4600±n/a nM
Citation Lee, DBhat, KPFong, HHFarnsworth, NRPezzuto, JMKinghorn, AD Aromatase inhibitors from Broussonetia papyrifera. J Nat Prod64:1286-93 (2001) Aromatase
Name:Aromatase
Type:Enzyme
Mol. Mass.:57888.92
Organism:Homo sapiens (Human)
Description:P11511
Residue:503
BDBM50251013
NameBDBM50251013
Synonyms:2,4,2',4'-tetrahydroxy-3'-prenylchalcone morachalcone A
TypeSmall organic molecule
Emp. Form.C20H20O5
Mol. Mass.340.3698
SMILES[#6]\[#6](-[#6])=[#6]\[#6]-c1c(-[#8])ccc(-[#6](=O)\[#6]=[#6]\c2ccc(-[#8])cc2-[#8])c1-[#8]