Reaction Details
TargetAromatase
LigandBDBM50250977
Substrate/Competitorn/a
Meas. Tech.ChEMBL_505994 (CHEMBL949646)
IC50 24000±n/a nM
Citation Lee, DBhat, KPFong, HHFarnsworth, NRPezzuto, JMKinghorn, AD Aromatase inhibitors from Broussonetia papyrifera. J Nat Prod64:1286-93 (2001) Aromatase
Name:Aromatase
Type:Enzyme
Mol. Mass.:57888.92
Organism:Homo sapiens (Human)
Description:P11511
Residue:503
BDBM50250977
NameBDBM50250977
Synonyms:5,7,2',4'-tetrahydroxy-3-geranylflavone | CHEMBL458187
TypeSmall organic molecule
Emp. Form.C25H26O6
Mol. Mass.422.4703
SMILES[#6]\[#6](-[#6])=[#6]\[#6]-[#6]\[#6](-[#6])=[#6]\[#6]-c1c(-[#8])c2c(cc(-[#8])cc2=O)oc1-c1ccc(-[#8])cc1-[#8]