Reaction Details
Target5-hydroxytryptamine receptor 2C
LigandBDBM10755
Substrate/Competitorn/a
Meas. Tech.ChEMBL_486953 (CHEMBL1012215)
Ki 130±n/a nM
Citation Hu, JFSchetz, JAKelly, MPeng, JNAng, KKFlotow, HLeong, CYNg, SBBuss, ADWilkins, SPHamann, MT New antiinfective and human 5-HT2 receptor binding natural and semisynthetic compounds from the Jamaican sponge Smenospongia aurea. J Nat Prod65:476-80 (2002) 5-hydroxytryptamine receptor 2C
Name:5-hydroxytryptamine receptor 2C
Type:G Protein-Coupled Receptor (GPCR)
Mol. Mass.:51836.79
Organism:Homo sapiens (Human)
Description:P28335
Residue:458
BDBM10755
NameBDBM10755
Synonyms:14C-5-hydroxy tryptamine creatinine disulfate 5-HT 5-hydroxy tryptamine creatinine disulfate Serotonin | [3H]-5-HT
TypeSmall organic molecule
Emp. Form.C10H12N2O
Mol. Mass.176.2151
SMILESNCCc1c[nH]c2ccc(O)cc12