Reaction Details
TargetEstrogen receptor beta
LigandBDBM19459
Substrate/Competitorn/a
Meas. Tech.ChEMBL_509492 (CHEMBL1008128)
IC50 18±n/a nM
Citation Calderón, AITerreaux, CSchenk, KPattison, PBurdette, JEPezzuto, JMGupta, MPHostettmann, K Isolation and structure elucidation of an isoflavone and a sesterterpenoic acid from Henriettella fascicularis. J Nat Prod65:1749-53 (2002) 
 
Estrogen receptor beta
Name:Estrogen receptor beta
Type:Protein
Mol. Mass.:59238.43
Organism:Homo sapiens (Human)
Description:Q92731
Residue:530
BDBM19459
NameBDBM19459
Synonyms:5,7-dihydroxy-3-(4-hydroxyphenyl)-4H-chromen-4-one Genistein Genisteol US8552057, 2 | cid_5280961
TypePhytoestrogen
Emp. Form.C15H10O5
Mol. Mass.270.2369
SMILESOc1ccc(cc1)-c1coc2cc(O)cc(O)c2c1=O