Reaction Details
TargetBeta-galactosidase
LigandBDBM50242067
Substrate/Competitorn/a
Meas. Tech.ChEMBL_550271 (CHEMBL1007619)
IC50 90±n/a nM
Citation Asano, NIkeda, KKasahara, MArai, YKizu, H Glycosidase-inhibiting pyrrolidines and pyrrolizidines with a long side chain in Scilla peruviana. J Nat Prod67:846-50 (2004) 
 
Beta-galactosidase
Name:Beta-galactosidase
Type:Protein
Mol. Mass.:73420.88
Organism:Bos taurus (Bovine)
Description:n/a
Residue:653
BDBM50242067
NameBDBM50242067
Synonyms:CHEMBL469435 | alpha-1-C-(1,10,13-Trihydroxytridecyl)-1,4-dideoxy-1,4-imino-D-arabinitol
TypeSmall organic molecule
Emp. Form.C18H37NO8
Mol. Mass.395.4883
SMILESOCC(O)CCCCC(O)CC(O)CCC[C@@H](O)[C@H]1N[C@H](CO)[C@@H](O)[C@@H]1O