Reaction Details
TargetDNA polymerase beta
LigandBDBM50250427
Substrate/Competitorn/a
Meas. Tech.ChEMBL_547029 (CHEMBL1036027)
IC50 4300±n/a nM
Citation Deng, JZStarck, SRLi, SHecht, SM (+)-Myristinins A and D from Knema elegans, which inhibit DNA polymerase beta and cleave DNA. J Nat Prod68:1625-8 (2005) 
 
DNA polymerase beta
Name:DNA polymerase beta
Type:PROTEIN
Mol. Mass.:38334.34
Organism:Rattus norvegicus
Description:ChEMBL_1361926
Residue:335
BDBM50250427
NameBDBM50250427
Synonyms:(+)-Myristinin D | CHEMBL448072
TypeSmall organic molecule
Emp. Form.C36H38O7
Mol. Mass.582.6827
SMILESOc1ccc(cc1)[C@@H]1C[C@H](c2ccc(O)cc2O1)c1c(O)cc(O)c(C(=O)CCCCCCCCc2ccccc2)c1O