Reaction Details
TargetCasein kinase II subunit alpha
LigandBDBM50260228
Substrate/Competitorn/a
Meas. Tech.ChEMBL_508727 (CHEMBL1004021)
IC50>100000±n/a nM
Citation Quintavalle, MSambucini, SSumma, VOrsatti, LTalamo, FDe Francesco, RNeddermann, P Hepatitis C virus NS5A is a direct substrate of casein kinase I-alpha, a cellular kinase identified by inhibitor affinity chromatography using specific NS5A hyperphosphorylation inhibitors. J Biol Chem282:5536-44 (2007) 
 
Casein kinase II subunit alpha
Name:Casein kinase II subunit alpha
Type:Enzyme
Mol. Mass.:45151.12
Organism:Homo sapiens (Human)
Description:P68400
Residue:391
BDBM50260228
NameBDBM50260228
Synonyms:CHEMBL489344 | N-methyl-4-(2-(piperidin-4-yl)-5-(3-(trifluoromethyl)phenyl)-1H-imidazol-4-yl)pyrimidin-2-amine
TypeSmall organic molecule
Emp. Form.C20H21F3N6
Mol. Mass.402.4161
SMILESCNc1nccc(n1)-c1nc([nH]c1-c1cccc(c1)C(F)(F)F)C1CCNCC1