Reaction Details
TargetEpidermal growth factor receptor
LigandBDBM4815
Substrate/Competitorn/a
Meas. Tech.ChEMBL_509296 (CHEMBL996040)
IC50 3000±n/a nM
Citation Rellos, PIvins, FJBaxter, JEPike, ANott, TJParkinson, DMDas, SHowell, SFedorov, OShen, QYFry, AMKnapp, SSmerdon, SJ Structure and regulation of the human Nek2 centrosomal kinase. J Biol Chem282:6833-42 (2007) 
 
Epidermal growth factor receptor
Name:Epidermal growth factor receptor
Type:Receptor Kinase Domain
Mol. Mass.:134279.59
Organism:Homo sapiens (Human)
Description:P00533
Residue:1210
BDBM4815
NameBDBM4815
Synonyms:5-{[(3Z)-5-chloro-2-oxo-2,3-dihydro-1H-indol-3-ylidene]methyl}-N-[2-(diethylamino)ethyl]-2,4-dimethyl-1H-pyrrole-3-carboxamide SU11248 analog 12c | US10981896, Compound 572660
TypeSmall organic molecule
Emp. Form.C22H27ClN4O2
Mol. Mass.414.928
SMILESCCN(CC)CCNC(=O)c1c(C)[nH]c(\C=C2/C(=O)Nc3ccc(Cl)cc23)c1C