Reaction Details
TargetThymidylate synthase
LigandBDBM50251175
Substrate/Competitorn/a
Meas. Tech.ChEMBL_530826 (CHEMBL969381)
Ki 16000±n/a nM
Citation Corona, PLoriga, MCosti, MPFerrari, SPaglietti, G Synthesis of N-(5,7-diamino-3-phenyl-quinoxalin-2-yl)-3,4,5-substituted anilines and N-[4[(5,7-diamino-3-phenylquinoxalin-2-yl)amino]benzoyl]-l-glutamic acid diethyl ester: evaluation of in vitro anti-cancer and anti-folate activities. Eur J Med Chem43:189-203 (2008) 
 
Thymidylate synthase
Name:Thymidylate synthase
Type:Enzyme
Mol. Mass.:35718.07
Organism:Homo sapiens (Human)
Description:n/a
Residue:313
BDBM50251175
NameBDBM50251175
Synonyms:CHEMBL510652 | N-[4(5,7-Dinitro-3-phenyl-quinoxalin-2-ylamino)-benzoyl]glutamic acid diethyl ester
TypeSmall organic molecule
Emp. Form.C30H28N6O9
Mol. Mass.616.5781
SMILESCCOC(=O)CCC(NC(=O)c1ccc(Nc2nc3cc(cc([N+]([O-])=O)c3nc2-c2ccccc2)[N+]([O-])=O)cc1)C(=O)OCC