Reaction Details
TargetThymidylate synthase
LigandBDBM50251157
Substrate/Competitorn/a
Meas. Tech.ChEMBL_530824 (CHEMBL969379)
Ki 6000±n/a nM
Citation Corona, PLoriga, MCosti, MPFerrari, SPaglietti, G Synthesis of N-(5,7-diamino-3-phenyl-quinoxalin-2-yl)-3,4,5-substituted anilines and N-[4[(5,7-diamino-3-phenylquinoxalin-2-yl)amino]benzoyl]-l-glutamic acid diethyl ester: evaluation of in vitro anti-cancer and anti-folate activities. Eur J Med Chem43:189-203 (2008) 
 
Thymidylate synthase
Name:Thymidylate synthase
Type:Enzyme
Mol. Mass.:36576.54
Organism:Lactobacillus casei
Description:n/a
Residue:316
BDBM50251157
NameBDBM50251157
Synonyms:2-[(3,4-Dimethoxy-phenyl)amino]-3-phenyl-5,7-diamino-quinoxaline | CHEMBL464503
TypeSmall organic molecule
Emp. Form.C22H21N5O2
Mol. Mass.387.4344
SMILESCOc1ccc(Nc2nc3cc(N)cc(N)c3nc2-c2ccccc2)cc1OC