Reaction Details
TargetCannabinoid receptor 1
LigandBDBM50251193
Substrate/Competitorn/a
Meas. Tech.ChEMBL_531309 (CHEMBL989721)
IC50 2620±n/a nM
Citation Moloney, GPAngus, JARobertson, ADStoermer, MJRobinson, MWright, CEMcRae, KChristopoulos, A Synthesis and cannabinoid activity of 1-substituted-indole-3-oxadiazole derivatives: novel agonists for the CB1 receptor. Eur J Med Chem43:513-39 (2008) 
 
Cannabinoid receptor 1
Name:Cannabinoid receptor 1
Type:G Protein-Coupled Receptor (GPCR)
Mol. Mass.:52856.55
Organism:Rattus norvegicus (rat)
Description:P20272
Residue:473
BDBM50251193
NameBDBM50251193
Synonyms:3-[3-Benzyl-[1,2,4]oxadiazol-5-yl]-1-(2-morpholin-4-yl-ethyl)-1H-indole | CHEMBL517157
TypeSmall organic molecule
Emp. Form.C23H24N4O2
Mol. Mass.388.4623
SMILESC(Cn1cc(-c2nc(Cc3ccccc3)no2)c2ccccc12)N1CCOCC1