Reaction Details
TargetC-X-C chemokine receptor type 4
LigandBDBM50270277
Substrate/Competitorn/a
Meas. Tech.ChEMBL_506040 (CHEMBL950635)
Ki 1700±n/a nM
Citation Rosenkilde, MMGerlach, LOHatse, SSkerlj, RTSchols, DBridger, GJSchwartz, TW Molecular mechanism of action of monocyclam versus bicyclam non-peptide antagonists in the CXCR4 chemokine receptor. J Biol Chem282:27354-65 (2007) 
 
C-X-C chemokine receptor type 4
Name:C-X-C chemokine receptor type 4
Type:Enzyme
Mol. Mass.:39754.61
Organism:Homo sapiens (Human)
Description:P61073
Residue:352
BDBM50270277
NameBDBM50270277
Synonyms:Benzyl-[4-(1,4,8,11tetraaza-cyclotetradec-1-ylmethyl)-benzyl]-amine N-[1,4,8,11-Tetraazacyclotetradecanyl-1,4-phenylenebis(methylene)]-benzylamine
TypeSmall organic molecule
Emp. Form.C25H39N5
Mol. Mass.409.6107
SMILESC(NCc1ccc(CN2CCCNCCNCCCNCC2)cc1)c1ccccc1