Reaction Details
TargetC-X-C chemokine receptor type 4
LigandBDBM50270276
Substrate/Competitorn/a
Meas. Tech.ChEMBL_506015 (CHEMBL950610)
Ki 110±n/a nM
Citation Rosenkilde, MMGerlach, LOHatse, SSkerlj, RTSchols, DBridger, GJSchwartz, TW Molecular mechanism of action of monocyclam versus bicyclam non-peptide antagonists in the CXCR4 chemokine receptor. J Biol Chem282:27354-65 (2007) 
 
C-X-C chemokine receptor type 4
Name:C-X-C chemokine receptor type 4
Type:Enzyme
Mol. Mass.:39754.61
Organism:Homo sapiens (Human)
Description:P61073
Residue:352
BDBM50270276
NameBDBM50270276
Synonyms:CHEMBL477121 Pyridin-2-ylmethyl-[4-(1,4,8,11tetraaza-cyclotetradec-1-ylmethyl)-benzyl]-amine
TypeSmall organic molecule
Emp. Form.C24H38N6
Mol. Mass.410.5987
SMILESC(NCc1ccccn1)c1ccc(CN2CCCNCCNCCCNCC2)cc1