Reaction Details
TargetHistidinol dehydrogenase
LigandBDBM50267972
Substrate/Competitorn/a
Meas. Tech.ChEMBL_565320 (CHEMBL955161)
IC50 6±n/a nM
Citation Joseph, PAbdo, MRBoigegrain, RAMontero, JLWinum, JYKöhler, S Targeting of the Brucella suis virulence factor histidinol dehydrogenase by histidinol analogues results in inhibition of intramacrophagic multiplication of the pathogen. Antimicrob Agents Chemother51:3752-5 (2007) 
 
Histidinol dehydrogenase
Name:Histidinol dehydrogenase
Type:PROTEIN
Mol. Mass.:46060.70
Organism:Brucella suis
Description:ChEMBL_436509
Residue:430
BDBM50267972
NameBDBM50267972
Synonyms:(S)-3-Amino-4-(1H-imidazol-4-yl)-1-phenyl-butan-2-one; dihydrochloride CHEMBL500316
TypeSmall organic molecule
Emp. Form.C13H15N3O
Mol. Mass.229.2777
SMILESN[C@@H](Cc1cnc[nH]1)C(=O)Cc1ccccc1