Reaction Details
TargetSqualene synthase
LigandBDBM50269928
Substrate/Competitorn/a
Meas. Tech.ChEMBL_520603 (CHEMBL959525)
IC50>1000±n/a nM
Citation Cammerer, SBJimenez, CJones, SGros, LLorente, SORodrigues, CRodrigues, JCCaldera, ARuiz Perez, LMda Souza, WKaiser, MBrun, RUrbina, JAGonzalez Pacanowska, DGilbert, IH Quinuclidine derivatives as potential antiparasitics. Antimicrob Agents Chemother51:4049-61 (2007) 
 
Squalene synthase
Name:Squalene synthase
Synonyms:Farnesyltransferase, putative
Type:PROTEIN
Mol. Mass.:47117.40
Organism:Leishmania major
Description:ChEMBL_520603
Residue:414
BDBM50269928
NameBDBM50269928
TypeSmall organic molecule
Emp. Form.C20H21NO
Mol. Mass.291.3868
SMILESOC[C@H]1CC2CCN1C[C@@H]2C#Cc1ccc2ccccc2c1