Reaction Details
TargetSqualene synthase
LigandBDBM50270302
Substrate/Competitorn/a
Meas. Tech.ChEMBL_520603 (CHEMBL959525)
IC50 490±n/a nM
Citation Cammerer, SBJimenez, CJones, SGros, LLorente, SORodrigues, CRodrigues, JCCaldera, ARuiz Perez, LMda Souza, WKaiser, MBrun, RUrbina, JAGonzalez Pacanowska, DGilbert, IH Quinuclidine derivatives as potential antiparasitics. Antimicrob Agents Chemother51:4049-61 (2007) 
 
Squalene synthase
Name:Squalene synthase
Synonyms:Farnesyltransferase, putative
Type:PROTEIN
Mol. Mass.:47117.40
Organism:Leishmania major
Description:ChEMBL_520603
Residue:414
BDBM50270302
NameBDBM50270302
TypeSmall organic molecule
Emp. Form.C18H19NO
Mol. Mass.265.3496
SMILESCOc1ccc2cc(ccc2c1)C1=CN2CCC1CC2