Reaction Details
TargetBeta-lactamase
LigandBDBM50021959
Substrate/Competitorn/a
Meas. Tech.ChEMBL_520656 (CHEMBL962725)
IC50 8600±n/a nM
Citation Robin, FDelmas, JBrebion, ADubois, DConstantin, JMBonnet, R TEM-158 (CMT-9), a new member of the CMT-type extended-spectrum beta-lactamases. Antimicrob Agents Chemother51:4181-3 (2007) 
 
Beta-lactamase
Name:Beta-lactamase
Synonyms:Beta-lactamase TEM-125
Type:PROTEIN
Mol. Mass.:31361.12
Organism:Escherichia coli
Description:ChEMBL_520656
Residue:286
BDBM50021959
NameBDBM50021959
TypeSmall organic molecule
Emp. Form.C8H9NO5
Mol. Mass.199.1608
SMILESOC\C=C1/O[C@@H]2CC(=O)N2[C@H]1C(O)=O