Reaction Details
TargetThyroid hormone receptor alpha
LigandBDBM50242404
Substrate/Competitorn/a
Meas. Tech.ChEMBL_533636 (CHEMBL969512)
Ki 12500±n/a nM
Citation Erion, MDCable, EEIto, BRJiang, HFujitaki, JMFinn, PDZhang, BHHou, JBoyer, SHvan Poelje, PDLinemeyer, DL Targeting thyroid hormone receptor-beta agonists to the liver reduces cholesterol and triglycerides and improves the therapeutic index. Proc Natl Acad Sci U S A104:15490-5 (2007) 
 
Thyroid hormone receptor alpha
Name:Thyroid hormone receptor alpha
Type:Receptor
Mol. Mass.:54818.00
Organism:Homo sapiens (Human)
Description:Recombinant hThR was obtained from nuclear extracts from SF9 cells infected with baculovirus vectors encoding for ThRalpha 1.
Residue:490
BDBM50242404
NameBDBM50242404
Synonyms:(4S)-4-(3-chlorophenyl)-2-[(3,5-dimethyl-4-(4-hydroxy-3-isopropylbenzyl)phenoxy)methyl]-2-oxido-[1,3,2]-dioxaphosphonane MB-07811
TypeSmall organic molecule
Emp. Form.C28H32ClO5P
Mol. Mass.514.977
SMILESCC(C)c1cc(Cc2c(C)cc(OCP3(=O)OCC[C@H](O3)c3cccc(Cl)c3)cc2C)ccc1O