Reaction Details
TargetEpidermal growth factor receptor
LigandBDBM50247551
Substrate/Competitorn/a
Meas. Tech.ChEMBL_519199 (CHEMBL945670)
IC50 209±n/a nM
Citation Lüth, ALöwe, W Syntheses of 4-(indole-3-yl)quinazolines: a new class of epidermal growth factor receptor tyrosine kinase inhibitors. Eur J Med Chem43:1478-88 (2008) 
 
Epidermal growth factor receptor
Name:Epidermal growth factor receptor
Type:Receptor Kinase Domain
Mol. Mass.:134279.59
Organism:Homo sapiens (Human)
Description:P00533
Residue:1210
BDBM50247551
NameBDBM50247551
Synonyms:4-(5-Chloro-6-fluoroindole-3-yl)-6,7-dimethoxyquinazoline | CHEMBL515401
TypeSmall organic molecule
Emp. Form.C18H13ClFN3O2
Mol. Mass.357.766
SMILESCOc1cc2ncnc(-c3c[nH]c4cc(F)c(Cl)cc34)c2cc1OC