Reaction Details
TargetAldo-keto reductase family 1 member B1
LigandBDBM16312
Substrate/Competitorn/a
Meas. Tech.ChEMBL_529877 (CHEMBL968427)
IC50 249±n/a nM
Citation Alexiou, PNicolaou, IStefek, MKristl, ADemopoulos, VJ Design and synthesis of N-(3,5-difluoro-4-hydroxyphenyl)benzenesulfonamides as aldose reductase inhibitors. Bioorg Med Chem16:3926-32 (2008) 
 
Aldo-keto reductase family 1 member B1
Name:Aldo-keto reductase family 1 member B1
Type:PROTEIN
Mol. Mass.:35797.87
Organism:Rattus norvegicus
Description:ChEMBL_1512484
Residue:316
BDBM16312
NameBDBM16312
Synonyms:(4S)-6-fluoro-2,3-dihydrospiro[1-benzopyran-4,4'-imidazolidine]-2',5'-dione Sorbinil
TypeSmall organic molecule
Emp. Form.C11H9FN2O3
Mol. Mass.236.1992
SMILESFc1ccc2OCC[C@]3(NC(=O)NC3=O)c2c1