Reaction Details
TargetCyclin-dependent kinase 2
LigandBDBM7533
Substrate/Competitorn/a
Meas. Tech.ChEMBL_543841 (CHEMBL1016031)
IC50 700±n/a nM
Citation Bouchikhi, FRossignol, ESancelme, MAboab, BAnizon, FFabbro, DPrudhomme, MMoreau, P Synthesis and biological evaluation of diversely substituted indolin-2-ones. Eur J Med Chem43:2316-22 (2008) 
 
Cyclin-dependent kinase 2
Name:Cyclin-dependent kinase 2
Type:Enzyme Subunit
Mol. Mass.:33938.17
Organism:Homo sapiens (Human)
Description:P24941
Residue:298
BDBM7533
NameBDBM7533
Synonyms:(2R)-2-[[6-(benzylamino)-9-isopropyl-purin-2-yl]amino]butan-1-ol (2R)-2-[[6-[(phenylmethyl)amino]-9-propan-2-yl-2-purinyl]amino]-1-butanol (2R)-2-{[6-(benzylamino)-9-(propan-2-yl)-9H-purin-2-yl]amino}butan-1-ol 2,6,9-Trisubstituted purine deriv. 28 CYC-202 cid_160355
TypeSmall organic molecule
Emp. Form.C19H26N6O
Mol. Mass.354.4493
SMILESCC[C@H](CO)Nc1nc(NCc2ccccc2)c2ncn(C(C)C)c2n1