Reaction Details
TargetD(2) dopamine receptor
LigandBDBM50251330
Substrate/Competitorn/a
Meas. Tech.ChEMBL_533451 (CHEMBL986943)
Ki 345±n/a nM
Citation Sipos, ACsutorás, CBerényi, SUustare, ARinken, A Synthesis and neuropharmacological characterization of 2-O-substituted apomorphines. Bioorg Med Chem16:4563-8 (2008) 
 
D(2) dopamine receptor
Name:D(2) dopamine receptor
Type:G Protein-Coupled Receptor (GPCR)
Mol. Mass.:50931.60
Organism:Rattus norvegicus (rat)
Description:P61169
Residue:444
BDBM50251330
NameBDBM50251330
Synonyms:1,2-Bis-[R-(-)-apomorphine-2'-oxy]ethane | CHEMBL442926
TypeSmall organic molecule
Emp. Form.C36H36N2O6
Mol. Mass.592.6808
SMILESCN1CCc2cc(OCCOc3cc4CCN(C)[C@@H]5Cc6ccc(O)c(O)c6-c(c3)c45)cc-3c2[C@H]1Cc1ccc(O)c(O)c-31