Reaction Details
TargetD(2) dopamine receptor
LigandBDBM50251026
Substrate/Competitorn/a
Meas. Tech.ChEMBL_533450 (CHEMBL986942)
Ki 88±n/a nM
Citation Sipos, ACsutorás, CBerényi, SUustare, ARinken, A Synthesis and neuropharmacological characterization of 2-O-substituted apomorphines. Bioorg Med Chem16:4563-8 (2008) 
 
D(2) dopamine receptor
Name:D(2) dopamine receptor
Type:Cell-surface receptors
Mol. Mass.:50647.10
Organism:Homo sapiens (Human)
Description:P14416
Residue:443
BDBM50251026
NameBDBM50251026
Synonyms:(R)-(-)-2-Phenyl-apomorphine hydrochloride CHEMBL465054
TypeSmall organic molecule
Emp. Form.C23H21NO2
Mol. Mass.343.4183
SMILESCN1CCc2cc(cc-3c2[C@H]1Cc1ccc(O)c(O)c-31)-c1ccccc1