Reaction Details
TargetD(1A) dopamine receptor
LigandBDBM50251329
Substrate/Competitorn/a
Meas. Tech.ChEMBL_533454 (CHEMBL986946)
Ki 7600±n/a nM
Citation Sipos, ACsutorás, CBerényi, SUustare, ARinken, A Synthesis and neuropharmacological characterization of 2-O-substituted apomorphines. Bioorg Med Chem16:4563-8 (2008) 
 
D(1A) dopamine receptor
Name:D(1A) dopamine receptor
Type:Enzyme
Mol. Mass.:49613.93
Organism:Mus musculus (Mouse)
Description:Q61616
Residue:446
BDBM50251329
NameBDBM50251329
Synonyms:2-{[R-(-)-Apomorphine-2'-oxy]ethoxy}-ethanol | CHEMBL516151
TypeSmall organic molecule
Emp. Form.C21H25NO5
Mol. Mass.371.4269
SMILESCN1CCc2cc(OCCOCCO)cc-3c2[C@H]1Cc1ccc(O)c(O)c-31