Reaction Details
TargetPro-cathepsin H
LigandBDBM50247192
Substrate/Competitorn/a
Meas. Tech.ChEMBL_518577 (CHEMBL959581)
Ki 137±n/a nM
Citation Li, JPetrassi, HMTumanut, CMasick, BTTrussell, CHarris, JL Substrate optimization for monitoring cathepsin C activity in live cells. Bioorg Med Chem17:1064-70 (2009) 
 
Pro-cathepsin H
Name:Pro-cathepsin H
Type:PROTEIN
Mol. Mass.:37402.31
Organism:Homo sapiens (Human)
Description:ChEMBL_1459870
Residue:335
BDBM50247192
NameBDBM50247192
Synonyms:(S)-2-amino-N-((S)-5-phenyl-1-(phenylsulfonyl)pent-1-en-3-yl)pentanamide | CHEMBL514348
TypeSmall organic molecule
Emp. Form.C22H28N2O3S
Mol. Mass.400.534
SMILESCCC[C@H](N)C(=O)N[C@@H](CCc1ccccc1)\C=C\S(=O)(=O)c1ccccc1