Reaction Details
TargetDipeptidyl peptidase 1
LigandBDBM50243232
Substrate/Competitorn/a
Meas. Tech.ChEMBL_518581 (CHEMBL959585)
IC50 4000±n/a nM
Citation Li, JPetrassi, HMTumanut, CMasick, BTTrussell, CHarris, JL Substrate optimization for monitoring cathepsin C activity in live cells. Bioorg Med Chem17:1064-70 (2009) 
 
Dipeptidyl peptidase 1
Name:Dipeptidyl peptidase 1
Type:Enzyme
Mol. Mass.:51857.28
Organism:Homo sapiens (Human)
Description:P53634
Residue:463
BDBM50243232
NameBDBM50243232
Synonyms:CHEMBL486232 N-((S)-4-methyl-1-oxo-1-((S)-5-phenyl-1-(phenylsulfonyl)pent-1-en-3-ylamino)pentan-2-yl)morpholine-4-carboxamide | N~2~-(MORPHOLIN-4-YLCARBONYL)-N~1~-[(1S,2E)-1-(2-PHENYLETHYL)-3-(PHENYLSULFONYL)PROP-2-ENYL]-D-LEUCINAMIDE
TypeSmall organic molecule
Emp. Form.C28H37N3O5S
Mol. Mass.527.675
SMILESCC(C)C[C@H](NC(=O)N1CCOCC1)C(=O)N[C@@H](CCc1ccccc1)C=CS(=O)(=O)c1ccccc1