Reaction Details
TargetCaspase-9
LigandBDBM50270346
Substrate/Competitorn/a
Meas. Tech.ChEMBL_530307 (CHEMBL980369)
IC50 93000±n/a nM
Citation Sakai, JYoshimori, ANose, YMizoroki, AOkita, NTakasawa, RTanuma, S Structure-based discovery of a novel non-peptidic small molecular inhibitor of caspase-3. Bioorg Med Chem16:4854-9 (2008) 
 
Caspase-9
Name:Caspase-9
Type:Enzyme
Mol. Mass.:46277.29
Organism:Homo sapiens (Human)
Description:n/a
Residue:416
BDBM50270346
NameBDBM50270346
Synonyms:4-(ethoxycarbonylmethoxy)-1-hydroxy-naphthalene-2-carboxylic acid | CHEMBL479009
TypeSmall organic molecule
Emp. Form.C15H14O6
Mol. Mass.290.2681
SMILESCCOC(=O)COc1cc(C(O)=O)c(O)c2ccccc12