Reaction Details
TargetMelanocortin receptor 3
LigandBDBM50261228
Substrate/Competitorn/a
Meas. Tech.ChEMBL_555530 (CHEMBL963790)
Ki 160±n/a nM
Citation Chen, CTucci, FCJiang, WTran, JAFleck, BAHoare, SRWen, JChen, TJohns, MMarkison, SFoster, ACMarinkovic, DChen, CWArellano, MHarman, JSaunders, JBozigian, HMarks, D Pharmacological and pharmacokinetic characterization of 2-piperazine-alpha-isopropyl benzylamine derivatives as melanocortin-4 receptor antagonists. Bioorg Med Chem16:5606-18 (2008) 
 
Melanocortin receptor 3
Name:Melanocortin receptor 3
Type:Enzyme
Mol. Mass.:36044.86
Organism:Homo sapiens (Human)
Description:P41968
Residue:323
BDBM50261228
NameBDBM50261228
Synonyms:1-{2-[(1S)-(Methylaminoacetamido)-2-methylpropyl]-4-chlorophenyl}-4-[(2R)-methyl-3-(2-methoxy-4-dichlorophenyl)propionyl]piperazine | CHEMBL467586
TypeSmall organic molecule
Emp. Form.C28H38Cl2N4O3
Mol. Mass.549.532
SMILESCNCC(=O)N[C@@H](C(C)C)c1cc(Cl)ccc1N1CCN(CC1)C(=O)[C@H](C)Cc1ccc(Cl)cc1OC