Reaction Details
TargetProteinase-activated receptor 1
LigandBDBM50261062
Substrate/Competitorn/a
Meas. Tech.ChEMBL_556010 (CHEMBL964660)
Ki 4.8±n/a nM
Citation Chackalamannil, SWang, YGreenlee, WJHu, ZXia, YAhn, HSBoykow, GHsieh, YPalamanda, JAgans-Fantuzzi, JKurowski, SGraziano, MChintala, M Discovery of a novel, orally active himbacine-based thrombin receptor antagonist (SCH 530348) with potent antiplatelet activity. J Med Chem51:3061-4 (2008) 
 
Proteinase-activated receptor 1
Name:Proteinase-activated receptor 1
Type:Protein
Mol. Mass.:47450.07
Organism:Homo sapiens (Human)
Description:P25116
Residue:425
BDBM50261062
NameBDBM50261062
Synonyms:1-ethyl-3-((1R,3aR,4aR,6R,8aR,9S,9aS)-9-((E)-2-(5-(3-fluorophenyl)pyridin-2-yl)vinyl)-1-methyl-3-oxo-dodecahydronaphtho[2,3-c]furan-6-yl)urea | CHEMBL523854
TypeSmall organic molecule
Emp. Form.C29H34FN3O3
Mol. Mass.491.597
SMILESCCNC(=O)N[C@@H]1CC[C@@H]2[C@H](C[C@@H]3[C@@H]([C@@H](C)OC3=O)[C@H]2C=Cc2ccc(cn2)-c2cccc(F)c2)C1