Reaction Details
TargetD-aspartate oxidase
LigandBDBM50004955
Substrate/Competitorn/a
Meas. Tech.ChEMBL_556667 (CHEMBL958954)
IC50>5000±n/a nM
Citation Sparey, TAbeywickrema, PAlmond, SBrandon, NByrne, NCampbell, AHutson, PHJacobson, MJones, BMunshi, SPascarella, DPike, APrasad, GSSachs, NSakatis, MSardana, VVenkatraman, SYoung, MB The discovery of fused pyrrole carboxylic acids as novel, potent D-amino acid oxidase (DAO) inhibitors. Bioorg Med Chem Lett18:3386-91 (2008) 
 
D-aspartate oxidase
Name:D-aspartate oxidase
Type:Oxidoreductase
Mol. Mass.:37543.06
Organism:Homo sapiens (Human)
Description:Recombinant human DDO expressed and purified from sf9 insect cells, was used in enzyme assays.
Residue:341
BDBM50004955
NameBDBM50004955
Synonyms:1H-Indole-2-carboxylic acid Indol-2-carboxylic acid | Indole-2-carboxylate
TypeSmall organic molecule
Emp. Form.C9H7NO2
Mol. Mass.161.1574
SMILESOC(=O)c1cc2ccccc2[nH]1