Reaction Details
TargetBeta-secretase 1
LigandBDBM14320
Substrate/Competitorn/a
Meas. Tech.ChEMBL_553553 (CHEMBL958736)
IC50 2000000±n/a nM
Citation Congreve, MChessari, GTisi, DWoodhead, AJ Recent developments in fragment-based drug discovery. J Med Chem51:3661-80 (2008) 
 
Beta-secretase 1
Name:Beta-secretase 1
Type:Protein
Mol. Mass.:55755.10
Organism:Homo sapiens (Human)
Description:P56817
Residue:501
BDBM14320
NameBDBM14320
Synonyms:1-amino-isoquinoline Fragment 17 isoquinolin-1-amine
TypeSmall organic molecule
Emp. Form.C9H8N2
Mol. Mass.144.1732
SMILESNc1nccc2ccccc12