Reaction Details
TargetProthrombin
LigandBDBM12582
Substrate/Competitorn/a
Meas. Tech.ChEMBL_553539 (CHEMBL958722)
IC50 330000±n/a nM
Citation Congreve, MChessari, GTisi, DWoodhead, AJ Recent developments in fragment-based drug discovery. J Med Chem51:3661-80 (2008) 
 
Prothrombin
Name:Prothrombin
Type:Protein
Mol. Mass.:70029.57
Organism:Homo sapiens (Human)
Description:P00734
Residue:622
BDBM12582
NameBDBM12582
Synonyms:1-(4-chlorophenyl)-1H-1,2,3,4-tetrazole CHEMBL440394 chlorophenyl-tetrazole compound 1
TypeSmall organic molecule
Emp. Form.C7H5ClN4
Mol. Mass.180.594
SMILESClc1ccc(cc1)-n1cnnn1