Reaction Details
TargetQueuine tRNA-ribosyltransferase catalytic subunit 1
LigandBDBM50271082
Substrate/Competitorn/a
Meas. Tech.ChEMBL_553551 (CHEMBL958734)
Ki 3700±n/a nM
Citation Congreve, MChessari, GTisi, DWoodhead, AJ Recent developments in fragment-based drug discovery. J Med Chem51:3661-80 (2008) 
 
Queuine tRNA-ribosyltransferase catalytic subunit 1
Name:Queuine tRNA-ribosyltransferase catalytic subunit 1
Type:PROTEIN
Mol. Mass.:44051.79
Organism:Homo sapiens (Human)
Description:ChEMBL_553551
Residue:403
BDBM50271082
NameBDBM50271082
Synonyms:4-(4-methoxyphenethyl)-6-amino-3H-imidazo[4,5-g]quinazolin-8(7H)-one CHEMBL487739
TypeSmall organic molecule
Emp. Form.C18H17N5O2
Mol. Mass.335.3599
SMILESCOc1ccc(CCc2c3[nH]cnc3cc3c2nc(N)[nH]c3=O)cc1