Reaction Details
TargetUrokinase-type plasminogen activator
LigandBDBM50135883
Substrate/Competitorn/a
Meas. Tech.ChEMBL_553536 (CHEMBL958719)
IC50>1000000±n/a nM
Citation Congreve, MChessari, GTisi, DWoodhead, AJ Recent developments in fragment-based drug discovery. J Med Chem51:3661-80 (2008) 
 
Urokinase-type plasminogen activator
Name:Urokinase-type plasminogen activator
Type:Enzyme
Mol. Mass.:48528.62
Organism:Homo sapiens (Human)
Description:P00749
Residue:431
BDBM50135883
NameBDBM50135883
Synonyms:(2R)-1-(2,6-dimethylphenoxy)propan-2-amine (R)-2-(2,6-Dimethyl-phenoxy)-1-methyl-ethylamine MEXILETINE
TypeSmall organic molecule
Emp. Form.C11H17NO
Mol. Mass.179.2588
SMILESC[C@@H](N)COc1c(C)cccc1C