Reaction Details
TargetBcl2-associated agonist of cell death
LigandBDBM50270876
Substrate/Competitorn/a
Meas. Tech.ChEMBL_553538 (CHEMBL958721)
IC50 6900±n/a nM
Citation Congreve, MChessari, GTisi, DWoodhead, AJ Recent developments in fragment-based drug discovery. J Med Chem51:3661-80 (2008) 
 
Bcl2-associated agonist of cell death
Name:Bcl2-associated agonist of cell death
Type:PROTEIN
Mol. Mass.:18393.69
Organism:Homo sapiens (Human)
Description:ChEMBL_478760
Residue:168
BDBM50270876
NameBDBM50270876
Synonyms:3-((E)-2-Biphenyl-3-yl-vinyl)-4'-fluoro-biphenyl-4-carboxylic acid | CHEMBL485891
TypeSmall organic molecule
Emp. Form.C27H19FO2
Mol. Mass.394.437
SMILESOC(=O)c1ccc(cc1\C=C\c1cccc(c1)-c1ccccc1)-c1ccc(F)cc1