Reaction Details
TargetCaspase-1
LigandBDBM50176515
Substrate/Competitorn/a
Meas. Tech.ChEMBL_553541 (CHEMBL958724)
IC50 190±n/a nM
Citation Congreve, MChessari, GTisi, DWoodhead, AJ Recent developments in fragment-based drug discovery. J Med Chem51:3661-80 (2008) 
 
Caspase-1
Name:Caspase-1
Type:Enzyme
Mol. Mass.:45154.13
Organism:Homo sapiens (Human)
Description:P29466
Residue:404
BDBM50176515
NameBDBM50176515
Synonyms:(S)-4-oxo-3-(6-(4-(quinoxalin-2-ylamino)benzamido)hexanamido)butanoic acid | CHEMBL377298
TypeSmall organic molecule
Emp. Form.C25H27N5O5
Mol. Mass.477.5124
SMILESOC(=O)C[C@H](NC(=O)CCCCCNC(=O)c1ccc(Nc2cnc3ccccc3n2)cc1)C=O