Reaction Details
TargetLanosterol synthase
LigandBDBM50271572
Substrate/Competitorn/a
Meas. Tech.ChEMBL_556115 (CHEMBL956674)
IC50 3±n/a nM
Citation Fouchet, MHDonche, FMartin, CBouillot, AJunot, CBoullay, ABPotvain, FMagny, SDCoste, HWalker, MIssandou, MDodic, N Design and evaluation of a novel series of 2,3-oxidosqualene cyclase inhibitors with low systemic exposure, relationship between pharmacokinetic properties and ocular toxicity. Bioorg Med Chem16:6218-32 (2008) 
 
Lanosterol synthase
Name:Lanosterol synthase
Type:PROTEIN
Mol. Mass.:83309.32
Organism:Homo sapiens (Human)
Description:ChEMBL_11231
Residue:732
BDBM50271572
NameBDBM50271572
Synonyms:1-[4-Chlorophenylcarbonyl]-4-[4-(pyridin-4-yl)phenylmethyl]-piperazine | CHEMBL482527
TypeSmall organic molecule
Emp. Form.C23H22ClN3O
Mol. Mass.391.893
SMILESClc1ccc(cc1)C(=O)N1CCN(Cc2ccc(cc2)-c2ccncc2)CC1