Reaction Details
TargetVascular endothelial growth factor receptor 2
LigandBDBM50271908
Substrate/Competitorn/a
Meas. Tech.ChEMBL_556141 (CHEMBL957463)
IC50>50000±n/a nM
Citation Gangjee, ANamjoshi, OAYu, JIhnat, MAThorpe, JEWarnke, LA Design, synthesis and biological evaluation of substituted pyrrolo[2,3-d]pyrimidines as multiple receptor tyrosine kinase inhibitors and antiangiogenic agents. Bioorg Med Chem16:5514-28 (2008) 
 
Vascular endothelial growth factor receptor 2
Name:Vascular endothelial growth factor receptor 2
Type:Receptor Tyrosine Kinase
Mol. Mass.:151510.97
Organism:Homo sapiens (Human)
Description:P35968
Residue:1356
BDBM50271908
NameBDBM50271908
Synonyms:CHEMBL502015 | N4-(3-bromophenyl)-2-(naphthalen-2-ylmethyl)-1H-indole-4,6-diamine
TypeSmall organic molecule
Emp. Form.C23H18BrN5
Mol. Mass.444.327
SMILESNc1nc(Nc2cccc(Br)c2)c2cc(Cc3ccc4ccccc4c3)[nH]c2n1