Reaction Details
TargetVascular endothelial growth factor receptor 2
LigandBDBM50271851
Substrate/Competitorn/a
Meas. Tech.ChEMBL_556141 (CHEMBL957463)
IC50>200000±n/a nM
Citation Gangjee, ANamjoshi, OAYu, JIhnat, MAThorpe, JEWarnke, LA Design, synthesis and biological evaluation of substituted pyrrolo[2,3-d]pyrimidines as multiple receptor tyrosine kinase inhibitors and antiangiogenic agents. Bioorg Med Chem16:5514-28 (2008) 
 
Vascular endothelial growth factor receptor 2
Name:Vascular endothelial growth factor receptor 2
Type:Receptor Tyrosine Kinase
Mol. Mass.:151510.97
Organism:Homo sapiens (Human)
Description:P35968
Residue:1356
BDBM50271851
NameBDBM50271851
Synonyms:CHEMBL519147 | N4-(4-Chlorophenyl)-6-(2-phenylethyl)-7H-pyrrolo[2,3-d ]pyrimidine-2,4-diamine
TypeSmall organic molecule
Emp. Form.C20H18ClN5
Mol. Mass.363.843
SMILESNc1nc(Nc2ccc(Cl)cc2)c2cc(CCc3ccccc3)[nH]c2n1