Reaction Details
TargetPlatelet-derived growth factor receptor beta
LigandBDBM33408
Substrate/Competitorn/a
Meas. Tech.ChEMBL_556142 (CHEMBL957464)
IC50 6200±n/a nM
Citation Gangjee, ANamjoshi, OAYu, JIhnat, MAThorpe, JEWarnke, LA Design, synthesis and biological evaluation of substituted pyrrolo[2,3-d]pyrimidines as multiple receptor tyrosine kinase inhibitors and antiangiogenic agents. Bioorg Med Chem16:5514-28 (2008) 
 
Platelet-derived growth factor receptor beta
Name:Platelet-derived growth factor receptor beta
Type:Enzyme
Mol. Mass.:123922.25
Organism:Homo sapiens (Human)
Description:P09619
Residue:1106
BDBM33408
NameBDBM33408
Synonyms:AG1295 cid_2048
TypeSmall organic molecule
Emp. Form.C16H14N2
Mol. Mass.234.2958
SMILESCc1cc2ncc(nc2cc1C)-c1ccccc1