Reaction Details
TargetNitric oxide synthase, brain
LigandBDBM50095181
Substrate/Competitorn/a
Meas. Tech.ChEMBL_552452 (CHEMBL1002712)
Ki 6.3±n/a nM
Citation Castaño, TEncinas, APérez, CCastro, ACampillo, NEGil, C Design, synthesis, and evaluation of potential inhibitors of nitric oxide synthase. Bioorg Med Chem16:6193-206 (2008) 
 
Nitric oxide synthase, brain
Name:Nitric oxide synthase, brain
Type:Homodimer
Mol. Mass.:160985.98
Organism:Homo sapiens (Human)
Description:P29475
Residue:1434
BDBM50095181
NameBDBM50095181
Synonyms:CHEMBL96680 | N-(3-Aminomethyl-phenyl)-furan-2-carboxamidine
TypeSmall organic molecule
Emp. Form.C12H13N3O
Mol. Mass.215.2511
SMILESNCc1cccc(NC(=N)c2ccco2)c1