Reaction Details
TargetMu-type opioid receptor
LigandBDBM50271443
Substrate/Competitorn/a
Meas. Tech.ChEMBL_556845 (CHEMBL964705)
IC50 29.3±n/a nM
Citation Wang, CLYao, JLYu, YShao, XCui, YLiu, HMLai, LHWang, R Structure-activity study of endomorphin-2 analogs with C-terminal modifications by NMR spectroscopy and molecular modeling. Bioorg Med Chem16:6415-22 (2008) 
 
Mu-type opioid receptor
Name:Mu-type opioid receptor
Synonyms:Mu-opioid receptor
Type:PROTEIN
Mol. Mass.:44729.40
Organism:Cavia porcellus
Description:ChEMBL_510437
Residue:400
BDBM50271443
NameBDBM50271443
TypeSmall organic molecule
Emp. Form.C32H38N4O5
Mol. Mass.558.6679
SMILESN[C@@H](Cc1ccc(O)cc1)C(=O)N1CCC[C@H]1C(=O)N[C@@H](Cc1ccccc1)C(=O)N[C@H](CO)Cc1ccccc1