Reaction Details
TargetMu-type opioid receptor
LigandBDBM50271443
Substrate/Competitorn/a
Meas. Tech.ChEMBL_556842 (CHEMBL964702)
Ki 6.34±n/a nM
Citation Wang, CLYao, JLYu, YShao, XCui, YLiu, HMLai, LHWang, R Structure-activity study of endomorphin-2 analogs with C-terminal modifications by NMR spectroscopy and molecular modeling. Bioorg Med Chem16:6415-22 (2008) 
 
Mu-type opioid receptor
Name:Mu-type opioid receptor
Type:G Protein-Coupled Receptor (GPCR)
Mol. Mass.:44503.11
Organism:Rattus norvegicus (rat)
Description:Competition binding assays were carried out using membrane preparations from transfected HN9.10 cells that constitutively expressed the mu opioid receptor.
Residue:398
BDBM50271443
NameBDBM50271443
Synonyms:CHEMBL522293 | Tyr-Pro-Phe-Phe-OCH2OH
TypeSmall organic molecule
Emp. Form.C32H38N4O5
Mol. Mass.558.6679
SMILESN[C@@H](Cc1ccc(O)cc1)C(=O)N1CCC[C@H]1C(=O)N[C@@H](Cc1ccccc1)C(=O)N[C@H](CO)Cc1ccccc1