Reaction Details
TargetNitric oxide synthase, inducible
LigandBDBM50209245
Substrate/Competitorn/a
Meas. Tech.ChEMBL_552618 (CHEMBL957262)
IC50 50000±n/a nM
Citation Cottyn, BAcher, FRamassamy, BAlvey, LLepoivre, MFrapart, YStuehr, DMansuy, DBoucher, JLVichard, D Inhibitory effects of a series of 7-substituted-indazoles toward nitric oxide synthases: particular potency of 1H-indazole-7-carbonitrile. Bioorg Med Chem16:5962-73 (2008) 
 
Nitric oxide synthase, inducible
Name:Nitric oxide synthase, inducible
Type:Enzyme
Mol. Mass.:130595.79
Organism:Mus musculus (mouse)
Description:Recombinant enzyme overexpressed in E. coli.
Residue:1144
BDBM50209245
NameBDBM50209245
Synonyms:CHEMBL247378
TypeSmall organic molecule
Emp. Form.C7H5N3O2
Mol. Mass.163.1335
SMILES[O-][N+](=O)c1cccc2cn[nH]c12