Reaction Details
TargetNitric oxide synthase, inducible
LigandBDBM50270528
Substrate/Competitorn/a
Meas. Tech.ChEMBL_552618 (CHEMBL957262)
IC50 2200±n/a nM
Citation Cottyn, BAcher, FRamassamy, BAlvey, LLepoivre, MFrapart, YStuehr, DMansuy, DBoucher, JLVichard, D Inhibitory effects of a series of 7-substituted-indazoles toward nitric oxide synthases: particular potency of 1H-indazole-7-carbonitrile. Bioorg Med Chem16:5962-73 (2008) 
 
Nitric oxide synthase, inducible
Name:Nitric oxide synthase, inducible
Type:Enzyme
Mol. Mass.:130595.79
Organism:Mus musculus (mouse)
Description:Recombinant enzyme overexpressed in E. coli.
Residue:1144
BDBM50270528
NameBDBM50270528
Synonyms:3-BROMO-7-NITROINDAZOLE CHEMBL479014
TypeSmall organic molecule
Emp. Form.C7H4BrN3O2
Mol. Mass.242.03
SMILES[O-][N+](=O)c1cccc2c(Br)n[nH]c12