Reaction Details
Target5-hydroxytryptamine receptor 1D
LigandBDBM50005835
Substrate/Competitorn/a
Meas. Tech.ChEMBL_552732 (CHEMBL965238)
Ki 1.2±n/a nM
Citation Choi, SKGreen, DHo, AKlein, UMarquess, DTaylor, RTurner, SD Designing selective, high affinity ligands of 5-HT1D receptor by covalent dimerization of 5-HT1F ligands derived from 4-fluoro-N-[3-(1-methyl-4-piperidinyl)-1H-indol-5-yl]benzamide. J Med Chem51:3609-16 (2008) 
 
5-hydroxytryptamine receptor 1D
Name:5-hydroxytryptamine receptor 1D
Type:G Protein-Coupled Receptor (GPCR)
Mol. Mass.:41920.63
Organism:Homo sapiens (Human)
Description:Receptor binding assays were performed using human clone stably expressed in CHO cells.
Residue:377
BDBM50005835
NameBDBM50005835
Synonyms:(3-[2-(dimethylamino)ethyl]-1H-indol-5-yl)-N-methylmethanesulfonamide 1-{3-[2-(dimethylamino)ethyl]-1H-indol-5-yl}-N-methylmethanesulfonamide 3-[2-(dimethylamino)ethyl]-N-methylindole-5-methanesulfonamide SUMATRIPTAN Sumax
TypeSmall organic molecule
Emp. Form.C14H21N3O2S
Mol. Mass.295.4
SMILESCNS(=O)(=O)Cc1ccc2[nH]cc(CCN(C)C)c2c1