Reaction Details
Target5-hydroxytryptamine receptor 1D
LigandBDBM50271019
Substrate/Competitorn/a
Meas. Tech.ChEMBL_552732 (CHEMBL965238)
Ki 0.300000±n/a nM
Citation Choi, SKGreen, DHo, AKlein, UMarquess, DTaylor, RTurner, SD Designing selective, high affinity ligands of 5-HT1D receptor by covalent dimerization of 5-HT1F ligands derived from 4-fluoro-N-[3-(1-methyl-4-piperidinyl)-1H-indol-5-yl]benzamide. J Med Chem51:3609-16 (2008) 
 
5-hydroxytryptamine receptor 1D
Name:5-hydroxytryptamine receptor 1D
Type:G Protein-Coupled Receptor (GPCR)
Mol. Mass.:41920.63
Organism:Homo sapiens (Human)
Description:Receptor binding assays were performed using human clone stably expressed in CHO cells.
Residue:377
BDBM50271019
NameBDBM50271019
Synonyms:4-fluoro-N-(3-{1-[7-(4-{5-[(4-fluorobenzene)amido]-1H-indol-3-yl}piperidin-1-yl)heptyl]piperidin-4-yl}-1H-indol-5-yl)benzamide | CHEMBL503468
TypeSmall organic molecule
Emp. Form.C47H52F2N6O2
Mol. Mass.770.9516
SMILESFc1ccc(cc1)C(=O)Nc1ccc2[nH]cc(C3CCN(CCCCCCCN4CCC(CC4)c4c[nH]c5ccc(NC(=O)c6ccc(F)cc6)cc45)CC3)c2c1