Reaction Details
Target5-hydroxytryptamine receptor 1A
LigandBDBM50054974
Substrate/Competitorn/a
Meas. Tech.ChEMBL_552738 (CHEMBL965244)
Ki 1.6±n/a nM
Citation Choi, SKGreen, DHo, AKlein, UMarquess, DTaylor, RTurner, SD Designing selective, high affinity ligands of 5-HT1D receptor by covalent dimerization of 5-HT1F ligands derived from 4-fluoro-N-[3-(1-methyl-4-piperidinyl)-1H-indol-5-yl]benzamide. J Med Chem51:3609-16 (2008) 
 
5-hydroxytryptamine receptor 1A
Name:5-hydroxytryptamine receptor 1A
Type:n/a
Mol. Mass.:46122.49
Organism:Homo sapiens (Human)
Description:n/a
Residue:422
BDBM50054974
NameBDBM50054974
Synonyms:2-(5-((4-((3-(2-aminoethyl)-1H-indol-5-yloxy)methyl)phenyl)methoxy)-1H-indol-3-yl)ethanamine CHEMBL144030
TypeSmall organic molecule
Emp. Form.C28H30N4O2
Mol. Mass.454.5634
SMILESNCCc1c[nH]c2ccc(OCc3ccc(COc4ccc5[nH]cc(CCN)c5c4)cc3)cc12