Reaction Details
Target5-hydroxytryptamine receptor 1D
LigandBDBM50271133
Substrate/Competitorn/a
Meas. Tech.ChEMBL_552732 (CHEMBL965238)
Ki 2.3±n/a nM
Citation Choi, SKGreen, DHo, AKlein, UMarquess, DTaylor, RTurner, SD Designing selective, high affinity ligands of 5-HT1D receptor by covalent dimerization of 5-HT1F ligands derived from 4-fluoro-N-[3-(1-methyl-4-piperidinyl)-1H-indol-5-yl]benzamide. J Med Chem51:3609-16 (2008) 
 
5-hydroxytryptamine receptor 1D
Name:5-hydroxytryptamine receptor 1D
Type:G Protein-Coupled Receptor (GPCR)
Mol. Mass.:41920.63
Organism:Homo sapiens (Human)
Description:Receptor binding assays were performed using human clone stably expressed in CHO cells.
Residue:377
BDBM50271133
NameBDBM50271133
Synonyms:CHEMBL500284 | N1,N15-bis(3-(1-methylpiperidin-4-yl)-1H-indol-5-yl)pentadecanediamide
TypeSmall organic molecule
Emp. Form.C43H62N6O2
Mol. Mass.694.9914
SMILESCN1CCC(CC1)c1c[nH]c2ccc(NC(=O)CCCCCCCCCCCCCC(=O)Nc3ccc4[nH]cc(C5CCN(C)CC5)c4c3)cc12