Reaction Details
Target5-hydroxytryptamine receptor 1D
LigandBDBM50271132
Substrate/Competitorn/a
Meas. Tech.ChEMBL_552732 (CHEMBL965238)
Ki 1.7±n/a nM
Citation Choi, SKGreen, DHo, AKlein, UMarquess, DTaylor, RTurner, SD Designing selective, high affinity ligands of 5-HT1D receptor by covalent dimerization of 5-HT1F ligands derived from 4-fluoro-N-[3-(1-methyl-4-piperidinyl)-1H-indol-5-yl]benzamide. J Med Chem51:3609-16 (2008) 
 
5-hydroxytryptamine receptor 1D
Name:5-hydroxytryptamine receptor 1D
Type:G Protein-Coupled Receptor (GPCR)
Mol. Mass.:41920.63
Organism:Homo sapiens (Human)
Description:Receptor binding assays were performed using human clone stably expressed in CHO cells.
Residue:377
BDBM50271132
NameBDBM50271132
Synonyms:CHEMBL502138 | N1,N14-bis(3-(1-methylpiperidin-4-yl)-1H-indol-5-yl)tetradecanediamide
TypeSmall organic molecule
Emp. Form.C42H60N6O2
Mol. Mass.680.9648
SMILESCN1CCC(CC1)c1c[nH]c2ccc(NC(=O)CCCCCCCCCCCCC(=O)Nc3ccc4[nH]cc(C5CCN(C)CC5)c4c3)cc12